CC [M] ../sm8650-modules/qcom/opensource/wlan/qcacld-3.0/.qca6750/cmn/hal/wifi3.0/hal_rx_flow.o LD [M] ../sm8650-modules/qcom/opensource/wlan/qcacld-3.0/.qca6750/qca_cld3_qca6750.o ld.lld: error: call to __read_overflow marked "dontcall-error": detected read beyond size of object (1st parameter) make[3]: *** [/home/sai/clover/kernel/oneplus/sm8650/scripts/Makefile.build:480: ../sm8650-modules/qcom/opensource/wlan/qcacld-3.0/.qca6750/qca_cld3_qca6750.o] Error 1 make[2]: *** [/home/sai/clover/kernel/oneplus/sm8650/Makefile:2178: ../sm8650-modules/qcom/opensource/wlan/qcacld-3.0/.qca6750] Error 2 make[2]: Leaving directory '/home/sai/clover/out/target/product/lexus/obj/KERNEL_OBJ' make[1]: *** [Makefile:256: __sub-make] Error 2 make[1]: Leaving directory '/home/sai/clover/kernel/oneplus/sm8650' make: *** [Makefile:67: all] Error 2 make: Leaving directory '/home/sai/clover/kernel/oneplus/sm8650-modules/qcom/opensource/wlan/qcacld-3.0'